{"text_format":"1","workbook":"xlsx","n_sheets":6,"sheets":["Revision History","Cover","Control_Panel","Data for submission ","Validation and Data Checks","Backsheet"],"not_rendered":{"charts":0,"images":1,"macros":0,"external_links":1,"defined_names":39,"comments":0,"pivot_tables":0},"unopened":[],"bounds":{"document_bytes":16777216,"sheet_cells":100000,"rows_first":2000,"rows_last":500,"rows_between":2000,"halvings":0,"cell_chars":16384,"cell_head_chars":4096},"cells_cut":0,"cells_raw":0,"read":"whole","date_system":"1900"}

{"sheet":"Revision History","index":0,"n_rows":13,"n_cols":4,"rows_kept":13,"cut":false,"hidden":true,"merged":[]}
[]
[null,"Revision History "]
[null,null,"WRES2"]
[null,"Version","Date","Change "]
[null,1,"2019-04-03","Changed dates - Owen Chinembiri"]
[null,2,"2019-06-06","Updated Template - MM"]
[null,3,"2019-06-12","Backsheet Added - AB"]
[null,3.1,"2019-06-13","Sheets locked down and upversioned for SharePoint and SDCS - RL"]
[null,4,"2019-06-14","Upversioned and error message made visible - RL"]
[null,5,"2019-06-17","Autocalculation formulae added back in from Mo's template - RL"]
[null,5.0999999999999996,"2019-07-01","Edited validation formula on Control Panel to check for right amount of cells - RL"]
[null,6,"2019-07-10","Updated Cells"]
[null,7,"2020-07-02","Updated backsheet/Cells/formulas. Work captured in DM-6438"]

{"sheet":"Cover","index":1,"n_rows":9,"n_cols":5,"rows_kept":9,"cut":false,"hidden":false,"merged":[[5,2,5,3],[5,4,6,4],[5,5,6,6],[1,1,2,12],[3,1,3,12],[15,3,15,5],[7,5,7,6],[8,2,8,3],[8,4,8,5],[12,3,12,4],[14,3,14,5]]}
[]
[null,"Workforce Race Equality \nStandards annual collection "]
[]
[null," as at March-2020"]
[]
[]
[]
[]
[null,null,"Period:",null,"April 2016-17"]

{"sheet":"Control_Panel","index":2,"n_rows":15,"n_cols":12,"rows_kept":15,"cut":false,"hidden":false,"merged":[[14,1,14,7],[1,1,1,7],[3,1,3,7],[4,1,6,7],[8,1,8,7],[13,1,13,7],[12,1,12,7],[11,1,11,7],[9,1,9,7],[10,1,10,7]]}
[null,null,null,null,null,null,null,null,null,null,"Backsheet check"]
[null,"Workforce Race Equality Standards",null,null,null,null,null,null,null,null,{"$f":"IF(SUM(IF(ISERROR(INDIRECT(\"Backsheet!\" &L2)),1,0))=0,0,1)","v":0},"A2:ZZ500"]
[]
[null,"Validations"]
[null,"Please correct all issues listed within the table below. If the issues are not corrected then the pro forma will fail the validation stage in SDCS. "]
[]
[]
[]
[null,"Trust - Frontsheet"]
[null,{"$f":"IF(COUNTA(answer_cells)<>342,\"Please complete all yellow answer cells on the 'Data for submission' tab. The 'Validation and Data Checks' tab can be used to identify which cells still need to be answered.\",\"\")","v":""},null,null,null,null,null,null,null,{"$f":"B10","v":""}]
[null,{"$f":"IF(SUM(COUNTIF(INDIRECT({\"'Data for submission '!$f$69\",\"'Data for submission '!$f$65:$f$66\",\"'Data for submission '!$g$65:$g$66\",\"'Data for submission '!$g$69\",\"'Data for submission '!$h$69\",\"'Data for submission '!$h$65:$h$66\",\"'Data for submission '!$i$65:$i$66\",\"'Data for submission '!$i$69\",\"'Data for submission '!$j$65:$j$66\",\"'Data for submission '!$j$69\",\"'Data for submission '!$k$65:$k$66\",\"'Data for submission '!$k$69\",\"'Data for submission '!$k$62\",\"'Data for submission '!$j$62\",\"'Data for submission '!$i$62\",\"'Data for submission '!$k$58\",\"'Data for submission '!$j$58\",\"'Data for submission '!$i$58\",\"'Data for submission '!$f$48:$f$52\",\"'Data for submission '!$g$48:$g$54\",\"'Data for submission '!$h$48:$h$54\",\"'Data for submission '!$i$48:$i$54\",\"'Data for submission '!$j$48:$j$54\",\"'Data for submission '!$k$48:$k$54\",\"'Data for submission '!$k$38:$k$46\",\"'Data for submission '!$j$33:$j$46\",\"'Data for submission '!$i$33:$i$46\",\"'Data for submission '!$h$33:$h$46\",\"'Data for submission '!$g$33:$g$46\",\"'Data for submission '!$f$33:$f$46\",\"'Data for submission '!$f$17:$f$30\",\"'Data for submission '!$g$17:$g$30\",\"'Data for submission '!$h$17:$h$30\",\"'Data for submission '!$i$17:$i$30\",\"'Data for submission '!$j$17:$j$30\",\"'Data for submission '!$k$17:$k$30\"}),\"*\"))>0,\"Please refer to the Validation and Data Checks Sheet.\",\"\")","v":""},null,null,null,null,null,null,null,{"$f":"B11","v":""}]
[null,{"$f":"IF(COUNTIF('Validation and Data Checks'!F18:K31,\"Error\")>0,\"Please refer to Validation and Data Checks Tab\",\"\")","v":""},null,null,null,null,null,null,null,{"$f":"B12","v":""}]
[null,{"$f":"IF(SUMPRODUCT(N(LEN('Data for submission '!L17:L78)>255)),\"You can only enter 255 characters in the notes field per cell, please can you review and amend\",\"\")","v":""},null,null,null,null,null,null,null,{"$f":"B13","v":""}]
[null,{"$f":"IF(K2=0,\"\",\"Cut and Paste is not permitted. This Template is broken. Please download a new template\")","v":""},null,null,null,null,null,null,null,{"$f":"IF(K2=0,\"\",\"Cut and Paste is not permitted. This Template is broken. Please download a new template\")","v":""}]
[null,{"$f":"IF(COUNTIF('Validation and Data Checks'!F17:K31,\"Error you have exceeded the character limit\")>0,\"Error you have exceeded the character limit. Please refer to Validation and Data Checks Tab\",\"\")","v":""}]
{"$rows_left_out":1}
{"sheet":"Data for submission ","index":3,"n_rows":78,"n_cols":18,"rows_kept":78,"cut":false,"hidden":false,"merged":[[12,8,12,10],[13,5,14,5],[13,6,14,6],[8,2,8,4],[12,5,12,7],[30,11,31,11],[46,8,46,10],[46,3,46,4],[13,7,14,7],[13,8,14,8],[13,9,14,9],[13,10,14,10],[30,8,31,10],[30,3,31,4],[13,3,14,3],[30,5,31,7],[46,5,46,7],[13,11,14,11],[64,0,77,0],[13,0,14,1],[13,4,14,4],[60,0,63,0],[64,1,77,1],[52,0,55,0],[15,0,51,0],[56,0,59,0],[13,2,14,2],[60,1,63,1],[56,1,59,1],[52,1,55,1],[15,1,51,1],[30,2,31,2]]}
[]
[]
[null,"SubmissionTemplate"]
[]
[null,"Workforce Race Equality Standards 2019/20 template"]
[]
[]
[]
[null,null,null,null,null,null,"Answer Required"]
[null,null,null,null,null,null,"Auto Populated"]
[null,null,null,null,null,null,"N/A"]
[]
[null,null,null,null,null,2019,null,null,2020]
["INDICATOR",null,"DATA ITEM",null,"MEASURE","WHITE","BME","ETHNICITY UNKNOWN/NULL","WHITE","BME","ETHNICITY UNKNOWN/NULL","Notes"]
[]
{"$rows_left_out":64}
{"sheet":"Validation and Data Checks","index":4,"n_rows":79,"n_cols":18,"rows_kept":79,"cut":false,"hidden":false,"merged":[[8,2,8,3],[12,8,12,10],[13,10,14,10],[13,11,14,11],[12,5,12,7],[13,5,14,5],[13,6,14,6],[13,7,14,7],[65,0,78,0],[13,9,14,9],[53,0,56,0],[53,1,56,1],[57,0,60,0],[57,1,60,1],[61,0,64,0],[61,1,64,1],[13,8,14,8],[16,0,52,0],[16,1,52,1],[13,0,14,1],[13,4,14,4]]}
[]
[]
[null,"SubmissionTemplate"]
[]
[null,"Workforce Race Equality Standards 2019/20 template"]
[]
[]
[]
[]
[null,null,null,null,null,{"$f":"IF(F8>0,\"There are errors. Please ensure all questions are answered\",\"\")","v":""}]
[]
[]
[null,null,null,null,null,2019,null,null,2020]
["INDICATOR",null,null,null,"MEASURE","WHITE","BME","ETHNICITY UNKNOWN/NULL","WHITE","BME","ETHNICITY UNKNOWN/NULL","Notes"]
[null,null,"DATA ITEM"]
{"$rows_left_out":65}
{"sheet":"Backsheet","index":5,"n_rows":64,"n_cols":15,"rows_kept":64,"cut":false,"hidden":true,"merged":[]}
["Data Item:N","LOOKUP_REF","ESRFiguresWhitePreviousYear:N","VerifiedFiguresWhitePreviousYear:N","ESRFiguresBMEPreviousYear:N","VerifiedFiguresBMEPreviousYear:N","ESRFiguresUnknownPreviousYear:N","VerifiedFiguresUnknownPreviousYear:N","ESRFiguresWhiteCurrentYear:N","VerifiedFiguresWhiteCurrentYear:N","ESRFiguresBMECurrentYear:N","VerifiedFiguresBMECurrentYear:N","ESRFiguresUnknownCurrentYear:N","VerifiedFiguresUnknownCurrentYear:N","WrcComments"]
[1,"Ind1_NC_Under Band 1",0,{"$f":"IF('Data for submission '!F17=\"\",0,'Data for submission '!F17)","v":16},0,{"$f":"IF('Data for submission '!G17=\"\",0,'Data for submission '!G17)","v":1},0,{"$f":"IF('Data for submission '!H17=\"\",0,'Data for submission '!H17)","v":3},0,{"$f":"IF('Data for submission '!I17=\"\",0,'Data for submission '!I17)","v":14},0,{"$f":"IF('Data for submission '!J17=\"\",0,'Data for submission '!J17)","v":1},0,{"$f":"IF('Data for submission '!K17=\"\",0,'Data for submission '!K17)","v":0},{"$f":"IF(ISBLANK('Data for submission '!H17),\"\",'Data for submission '!H17)","v":3}]
[2,"Ind1_NC_Band 1",0,{"$f":"IF('Data for submission '!F18=\"\",0,'Data for submission '!F18)","v":495},0,{"$f":"IF('Data for submission '!G18=\"\",0,'Data for submission '!G18)","v":11},0,{"$f":"IF('Data for submission '!H18=\"\",0,'Data for submission '!H18)","v":21},0,{"$f":"IF('Data for submission '!I18=\"\",0,'Data for submission '!I18)","v":167},0,{"$f":"IF('Data for submission '!J18=\"\",0,'Data for submission '!J18)","v":2},0,{"$f":"IF('Data for submission '!K18=\"\",0,'Data for submission '!K18)","v":10},{"$f":"IF(ISBLANK('Data for submission '!L18),\"\",'Data for submission '!L18)","v":""}]
[3,"Ind1_NC_Band 2",0,{"$f":"IF('Data for submission '!F19=\"\",0,'Data for submission '!F19)","v":364},0,{"$f":"IF('Data for submission '!G19=\"\",0,'Data for submission '!G19)","v":12},0,{"$f":"IF('Data for submission '!H19=\"\",0,'Data for submission '!H19)","v":9},0,{"$f":"IF('Data for submission '!I19=\"\",0,'Data for submission '!I19)","v":795},0,{"$f":"IF('Data for submission '!J19=\"\",0,'Data for submission '!J19)","v":23},0,{"$f":"IF('Data for submission '!K19=\"\",0,'Data for submission '!K19)","v":16},{"$f":"IF(ISBLANK('Data for submission '!L19),\"\",'Data for submission '!L19)","v":""}]
[4,"Ind1_NC_Band 3",0,{"$f":"IF('Data for submission '!F20=\"\",0,'Data for submission '!F20)","v":362},0,{"$f":"IF('Data for submission '!G20=\"\",0,'Data for submission '!G20)","v":3},0,{"$f":"IF('Data for submission '!H20=\"\",0,'Data for submission '!H20)","v":8},0,{"$f":"IF('Data for submission '!I20=\"\",0,'Data for submission '!I20)","v":365},0,{"$f":"IF('Data for submission '!J20=\"\",0,'Data for submission '!J20)","v":3},0,{"$f":"IF('Data for submission '!K20=\"\",0,'Data for submission '!K20)","v":7},{"$f":"IF(ISBLANK('Data for submission '!L20),\"\",'Data for submission '!L20)","v":""}]
[5,"Ind1_NC_Band 4",0,{"$f":"IF('Data for submission '!F21=\"\",0,'Data for submission '!F21)","v":139},0,{"$f":"IF('Data for submission '!G21=\"\",0,'Data for submission '!G21)","v":3},0,{"$f":"IF('Data for submission '!H21=\"\",0,'Data for submission '!H21)","v":4},0,{"$f":"IF('Data for submission '!I21=\"\",0,'Data for submission '!I21)","v":153},0,{"$f":"IF('Data for submission '!J21=\"\",0,'Data for submission '!J21)","v":3},0,{"$f":"IF('Data for submission '!K21=\"\",0,'Data for submission '!K21)","v":5},{"$f":"IF(ISBLANK('Data for submission '!L21),\"\",'Data for submission '!L21)","v":""}]
[6,"Ind1_NC_Band 5",0,{"$f":"IF('Data for submission '!F22=\"\",0,'Data for submission '!F22)","v":53},0,{"$f":"IF('Data for submission '!G22=\"\",0,'Data for submission '!G22)","v":0},0,{"$f":"IF('Data for submission '!H22=\"\",0,'Data for submission '!H22)","v":1},0,{"$f":"IF('Data for submission '!I22=\"\",0,'Data for submission '!I22)","v":49},0,{"$f":"IF('Data for submission '!J22=\"\",0,'Data for submission '!J22)","v":0},0,{"$f":"IF('Data for submission '!K22=\"\",0,'Data for submission '!K22)","v":0},{"$f":"IF(ISBLANK('Data for submission '!L22),\"\",'Data for submission '!L22)","v":""}]
[7,"Ind1_NC_Band 6",0,{"$f":"IF('Data for submission '!F23=\"\",0,'Data for submission '!F23)","v":65},0,{"$f":"IF('Data for submission '!G23=\"\",0,'Data for submission '!G23)","v":2},0,{"$f":"IF('Data for submission '!H23=\"\",0,'Data for submission '!H23)","v":2},0,{"$f":"IF('Data for submission '!I23=\"\",0,'Data for submission '!I23)","v":70},0,{"$f":"IF('Data for submission '!J23=\"\",0,'Data for submission '!J23)","v":1},0,{"$f":"IF('Data for submission '!K23=\"\",0,'Data for submission '!K23)","v":2},{"$f":"IF(ISBLANK('Data for submission '!L23),\"\",'Data for submission '!L23)","v":""}]
[8,"Ind1_NC_Band 7",0,{"$f":"IF('Data for submission '!F24=\"\",0,'Data for submission '!F24)","v":44},0,{"$f":"IF('Data for submission '!G24=\"\",0,'Data for submission '!G24)","v":3},0,{"$f":"IF('Data for submission '!H24=\"\",0,'Data for submission '!H24)","v":2},0,{"$f":"IF('Data for submission '!I24=\"\",0,'Data for submission '!I24)","v":48},0,{"$f":"IF('Data for submission '!J24=\"\",0,'Data for submission '!J24)","v":4},0,{"$f":"IF('Data for submission '!K24=\"\",0,'Data for submission '!K24)","v":2},{"$f":"IF(ISBLANK('Data for submission '!L24),\"\",'Data for submission '!L24)","v":""}]
[9,"Ind1_NC_Band 8A",0,{"$f":"IF('Data for submission '!F25=\"\",0,'Data for submission '!F25)","v":42},0,{"$f":"IF('Data for submission '!G25=\"\",0,'Data for submission '!G25)","v":0},0,{"$f":"IF('Data for submission '!H25=\"\",0,'Data for submission '!H25)","v":0},0,{"$f":"IF('Data for submission '!I25=\"\",0,'Data for submission '!I25)","v":44},0,{"$f":"IF('Data for submission '!J25=\"\",0,'Data for submission '!J25)","v":1},0,{"$f":"IF('Data for submission '!K25=\"\",0,'Data for submission '!K25)","v":0},{"$f":"IF(ISBLANK('Data for submission '!L25),\"\",'Data for submission '!L25)","v":""}]
[10,"Ind1_NC_Band 8B",0,{"$f":"IF('Data for submission '!F26=\"\",0,'Data for submission '!F26)","v":17},0,{"$f":"IF('Data for submission '!G26=\"\",0,'Data for submission '!G26)","v":0},0,{"$f":"IF('Data for submission '!H26=\"\",0,'Data for submission '!H26)","v":0},0,{"$f":"IF('Data for submission '!I26=\"\",0,'Data for submission '!I26)","v":18},0,{"$f":"IF('Data for submission '!J26=\"\",0,'Data for submission '!J26)","v":0},0,{"$f":"IF('Data for submission '!K26=\"\",0,'Data for submission '!K26)","v":0},{"$f":"IF(ISBLANK('Data for submission '!L26),\"\",'Data for submission '!L26)","v":""}]
[11,"Ind1_NC_Band 8C",0,{"$f":"IF('Data for submission '!F27=\"\",0,'Data for submission '!F27)","v":14},0,{"$f":"IF('Data for submission '!G27=\"\",0,'Data for submission '!G27)","v":0},0,{"$f":"IF('Data for submission '!H27=\"\",0,'Data for submission '!H27)","v":0},0,{"$f":"IF('Data for submission '!I27=\"\",0,'Data for submission '!I27)","v":19},0,{"$f":"IF('Data for submission '!J27=\"\",0,'Data for submission '!J27)","v":0},0,{"$f":"IF('Data for submission '!K27=\"\",0,'Data for submission '!K27)","v":0},{"$f":"IF(ISBLANK('Data for submission '!L27),\"\",'Data for submission '!L27)","v":""}]
[12,"Ind1_NC_Band 8D",0,{"$f":"IF('Data for submission '!F28=\"\",0,'Data for submission '!F28)","v":9},0,{"$f":"IF('Data for submission '!G28=\"\",0,'Data for submission '!G28)","v":0},0,{"$f":"IF('Data for submission '!H28=\"\",0,'Data for submission '!H28)","v":0},0,{"$f":"IF('Data for submission '!I28=\"\",0,'Data for submission '!I28)","v":8},0,{"$f":"IF('Data for submission '!J28=\"\",0,'Data for submission '!J28)","v":0},0,{"$f":"IF('Data for submission '!K28=\"\",0,'Data for submission '!K28)","v":0},{"$f":"IF(ISBLANK('Data for submission '!L28),\"\",'Data for submission '!L28)","v":""}]
[13,"Ind1_NC_Band 9",0,{"$f":"IF('Data for submission '!F29=\"\",0,'Data for submission '!F29)","v":0},0,{"$f":"IF('Data for submission '!G29=\"\",0,'Data for submission '!G29)","v":0},0,{"$f":"IF('Data for submission '!H29=\"\",0,'Data for submission '!H29)","v":0},0,{"$f":"IF('Data for submission '!I29=\"\",0,'Data for submission '!I29)","v":0},0,{"$f":"IF('Data for submission '!J29=\"\",0,'Data for submission '!J29)","v":0},0,{"$f":"IF('Data for submission '!K29=\"\",0,'Data for submission '!K29)","v":0},{"$f":"IF(ISBLANK('Data for submission '!L29),\"\",'Data for submission '!L29)","v":""}]
[14,"Ind1_NC_VSM",0,{"$f":"IF('Data for submission '!F30=\"\",0,'Data for submission '!F30)","v":8},0,{"$f":"IF('Data for submission '!G30=\"\",0,'Data for submission '!G30)","v":0},0,{"$f":"IF('Data for submission '!H30=\"\",0,'Data for submission '!H30)","v":0},0,{"$f":"IF('Data for submission '!I30=\"\",0,'Data for submission '!I30)","v":7},0,{"$f":"IF('Data for submission '!J30=\"\",0,'Data for submission '!J30)","v":0},0,{"$f":"IF('Data for submission '!K30=\"\",0,'Data for submission '!K30)","v":0},{"$f":"IF(ISBLANK('Data for submission '!L30),\"\",'Data for submission '!L30)","v":""}]
{"$rows_left_out":49}